ریزبین
preferred label: microscope @en
type: Concept
narrower: ریزبین سنگ‌نگاری

سنگ‌نگاری (زمین‌شناسی)
preferred label: petrography @en
type: Concept
related: ریزبین سنگ‌نگاری

ریزبین سنگ‌نگاری
alternative label: میکروسکوپ سنگ‌نگاری
scope note: ریزبینی/ میکروسکوپی که در آن از نور قطبیده و صفحۀ چرخان برای تحلیل مقاطع نازک سنگ‌نگاشتی استفاده شود.
related: سنگ‌نگاری (زمین‌شناسی)
broader: ریزبین
preferred label: petrographic microscope @en
type: Concept