منبع نور
preferred label: light source @en
type: Concept
related: تک‌فام‌ساز

تک‌فام‌ساز
alternative label: منبع نور تک‌رنگ
scope note: وسیله‌ای که از طیف پیوسته، تابشی تک‌فام تولید می‌کند.
related: منبع نور
broader: طیف‌نگار
preferred label: monochromator @en
type: Concept

طیف‌نگار
preferred label: spectrograph @en
type: Concept
narrower: تک‌فام‌ساز