دی‌اکسی‌ریبونوکلئیک‌اسید
alternative label: دنا (دی.ان.ای)
scope note: بسپاری متشکل از واحدهای دی‌اکسی‌ریبونوکلئوتید، حاوی اطلاعات وراثتی
broader: اسید هسته‌ای
preferred label: deoxyribonucleic acid @en
type: Concept

اسید هسته‌ای
preferred label: nucleic acid @en
type: Concept
narrower: دی‌اکسی‌ریبونوکلئیک‌اسید