لرزه‌نگار
preferred label: seismograph @en
type: Concept
narrower: لرزه‌نگار پهن‌باند

لرزه‌نگار پهن‌باند
scope note: لرزه‌نگاری که می‌تواند نشانک‌ها/ سیگنال‌های لرزه‌ای با دورۀ تناوب تقریبی از 0/1 تا 100 ثانیه را به‌دقت ثبت کند.
broader: لرزه‌نگار
preferred label: broadband seismograph @en
type: Concept