تلسکوپ بی‌کانون
scope note: تلسکوپی بدون کانون نهایی که در آن شیء و تصویر هر دو در بی‌نهایت هستند.
broader: تلسکوپ
preferred label: afocal telescope @en
type: Concept

تلسکوپ
preferred label: telescope @en
type: Concept
narrower: تلسکوپ بی‌کانون