تلسکوپ بالون‌برد
alternative label: تلسکوپ پوشن‌سپهری
scope note: تلسکوپی که برای کاهش تلاطم جوّی و رصد بهتر اجرام نجومی، آن را به‌وسیلۀ بالون به ارتفاعات بالای جوّ می‌فرستند.
broader: تلسکوپ
preferred label: balloon-borne telescope @en
type: Concept

تلسکوپ
preferred label: telescope @en
type: Concept
narrower: تلسکوپ بالون‌برد