تلسکوپ پرتوکیهانی
scope note: هر ابزاری برای آشکارسازی و جهت‌یابی پرتوهای کیهانی
broader: تلسکوپ
preferred label: cosmic-ray telescope @en
type: Concept

تلسکوپ
preferred label: telescope @en
type: Concept
narrower: تلسکوپ پرتوکیهانی