تلسکوپ استوایی
scope note: تلسکوپی که محور اصلی آن در امتداد محور دوران زمین تنظیم شده است.
broader: تلسکوپ
preferred label: equatorial telescope @en
type: Concept

تلسکوپ
preferred label: telescope @en
type: Concept
narrower: تلسکوپ استوایی