تلسکوپ پرتوگاما
scope note: تلسکوپ و آشکارسازی که از آن برای رصد کردن در گسترۀ پرتوگاما استفاده می‌کنند.
broader: تلسکوپ
preferred label: gamma-ray telescope @en
type: Concept

تلسکوپ
preferred label: telescope @en
type: Concept
narrower: تلسکوپ پرتوگاما