تلسکوپ خراشان‌فرود
scope note: تلسکوپی برای تصویرگیری (imaging) از پرتوهای ایکس و گاما که در آن نور فرودی به‌صورت تقریباً مماس بر آینه می‌تابد.
broader: تلسکوپ
preferred label: grazing-incidence telescope @en
type: Concept

تلسکوپ
preferred label: telescope @en
type: Concept
narrower: تلسکوپ خراشان‌فرود