تلسکوپ گریگوری
scope note: تلسکوپی دوآینه‌ای که آینۀ ثانویۀ آن کاو است.
broader: تلسکوپ
preferred label: Gregorian telescop @en
type: Concept

تلسکوپ
preferred label: telescope @en
type: Concept
narrower: تلسکوپ گریگوری