تلسکوپ اشمیت‌هلالی
alternative label: تلسکوپ ماکسوتوف ـ اشمیت
scope note: تلسکوپی با سامانۀ اپتیکی اشمیت که عدسی تصحیح‌گر آن از نوع عدسی هلالی است.
broader: تلسکوپ
preferred label: meniscus-Schmidt telescope @en
type: Concept

تلسکوپ
preferred label: telescope @en
type: Concept
narrower: تلسکوپ اشمیت‌هلالی