تلسکوپ چندآینه
scope note: تلسکوپی که در آن تصویر چند تلسکوپ معمولی، که همگی بر روی یک پایه استوارند و با سامانه‌های لیزری و رایانه‌ای هم‌تراز شده‌اند، به‌وسیلۀ سامانۀ آینه‌ای در یک نقطه متمرکز میشود.
broader: تلسکوپ
preferred label: multi-mirror telescope @en
type: Concept

تلسکوپ
preferred label: telescope @en
type: Concept
narrower: تلسکوپ چندآینه