تلسکوپ شکستی
scope note: تلسکوپی که در آن از یک عدسی بزرگ کاو برای جمع‌آوری نور اجرام نجومی استفاده میشود.
narrower: تلسکوپ گالیله‌ای
broader: تلسکوپ
preferred label: refracting telescope @en
type: Concept

تلسکوپ گالیله‌ای
preferred label: Galilean telescope @en
type: Concept
broader: تلسکوپ شکستی

تلسکوپ
preferred label: telescope @en
type: Concept
narrower: تلسکوپ شکستی