تلسکوپ سمت‌الرأسی
scope note: تلسکوپی که جهت آن همواره در محدودۀ کوچکی در اطرافِ سمت‌الرأس قابل تغییر است.
broader: تلسکوپ
preferred label: zenith telescope @en
type: Concept

تلسکوپ
preferred label: telescope @en
type: Concept
narrower: تلسکوپ سمت‌الرأسی