گران‌روی‌سنج گوی‌افتان
scope note: نوعی گران‌رَوی‌سنج برای اندازه‌گیری گران‌روی مذاب‌های بسپاری در آهنگ‌‌های برشی بسیار پایین که در آن یک گوی چگال‌تر از مذاب در درون مذاب و داخل استوانک فولادی در محدودۀ مشخصی حرکت می‌کند و براساس سرعت حرکت آن، گران‌رَوی اندازه‌گیری شود.
broader: گران‌روی‌سنج
preferred label: falling ball viscometer @en
type: Concept

گران‌روی‌سنج
preferred label: viscometer @en
type: Concept
narrower: گران‌روی‌سنج گوی‌افتان