ریل
preferred label: rail @en
type: Concept
related: گریس‌پاش ریل

روغن‌زن
preferred label: lubricator @en
type: Concept
narrower: گریس‌پاش ریل

گریس‌پاش ریل
scope note: ابزاری مکانیکی که در برخی از نقاط خط نصب می‌شود و چرخ‌های قطار را برای کاهش اصطکاک بین چرخ و ریل روغن‌کاری می‌کند.
related: ریل
broader: روغن‌زن
preferred label: rail lubricator @en
type: Concept