بارگنج
preferred label: container @en
type: Concept
related: بارکف‌بر

بارکف‌بر
scope note: افرازۀ کوچکی که از آن برای بارگیری و تخلیۀ بارکف‌ها در بارگُنج‌ها استفاده می‌شود.
related: بارگنج
broader: افرازه
preferred label: pallet truck @en
type: Concept

افرازه
preferred label: lift truck @en
type: Concept
narrower: بارکف‌بر