افرازه
preferred label: lift truck @en
type: Concept
related: بارکف

تجهیزات جابه‌جایی مواد
preferred label: materials handling equipment @en
type: Concept
narrower: بارکف

بارکف
alternative label: پالت
scope note: سازۀ مسطح و کوچک چوبی که زیر بار قرار دهند تا بتوان آن را با افرازه بلند کرد.
related: افرازه
broader: تجهیزات جابه‌جایی مواد
preferred label: pallet @en
type: Concept