پهلوبر
scope note: افرازه‌ای که قادر است از پهلو بارگُنج‌های واگن‌های باری و کفی‌ها را بارگیری و تخلیه و در محوطۀ بندر جابه‌جا کند.
related: واگن باری
broader: تجهیزات جابه‌جایی مواد
preferred label: side loader @en
type: Concept

واگن باری
preferred label: freight car @en
type: Concept
related: پهلوبر

تجهیزات جابه‌جایی مواد
preferred label: materials handling equipment @en
type: Concept
narrower: پهلوبر