بمب تأخیری
scope note: بمبی مجهز به ماسورۀ تنظیم‌شده که خرج را در زمانی معین و بعد از تماس با هدف منفجر می‌کند.
broader: بمب (تسلیحات)
preferred label: delayed action bomb @en
type: Concept

بمب (تسلیحات)
preferred label: bomb (ordnance) @en
type: Concept
narrower: بمب تأخیری