بمب زیرآبی
scope note: بمبی با ماسوره‌های هیدرواستاتیکی (hydrostatic) که با فشار آب در عمق عمل می‌کند و علیه هدف‌های زیرآبی به کار می‌رود.
broader: بمب (تسلیحات)
preferred label: depth bomb @en
type: Concept

بمب (تسلیحات)
preferred label: bomb (ordnance) @en
type: Concept
narrower: بمب زیرآبی