موشک تهاجمی پرسه‌زن
scope note: نوعی موشک پرسه‌زن که پس از پرتاب، با استفاده از فن پرسه‌زنی به هدف مورد نظر تک می‌زند.
broader: موشک پرسه‌زن
preferred label: loitering attack missile @en
type: Concept

موشک پرسه‌زن
preferred label: loitering missile @en
type: Concept
narrower: موشک تهاجمی پرسه‌زن