موشک پرتابشی
preferred label: ballistic missile @en
type: Concept
narrower: موشک پرتابشی زیردریایی

موشک پرتابشی زیردریایی
scope note: موشک پرتابشی که از زیردریایی پرتاب می‌شود و بُرد مؤثر آن از 5400 تا 10800 کیلومتر است.
broader: موشک پرتابشی
preferred label: submarine-launched ballistic missile @en
type: Concept