موشک هدایت‌شونده
preferred label: missile @en
type: Concept
narrower: موشک پرسرعت

موشک پرسرعت
scope note: موشکی با سرعت بیش از چهار کیلومتر در ثانیه
broader: موشک هدایت‌شونده
preferred label: hypervelocity missile @en
type: Concept