دوربین دوچشمی
scope note: وسیله‌ای اپتیکی شامل دو تلسکوپ همسان در کنار یکدیگر
broader: افزاره نوری
preferred label: binoculars @en
type: Concept

افزاره نوری
preferred label: optical device @en
type: Concept
narrower: دوربین دوچشمی