آینه ابرنما
scope note: آینه‌ای که در اَبرنمای آینه‌ای به کار می‌رود.
broader: آینه
preferred label: cloud mirror @en
type: Concept

آینه
preferred label: mirror @en
type: Concept
narrower: آینه ابرنما