آینه دوفام
scope note: آینه‌ای که نور را، بسته به طولِ‌موج یا رنگش، عبور یا بازتاب می‌دهد.
broader: آینه
preferred label: dichroic mirror @en
type: Concept

آینه
preferred label: mirror @en
type: Concept
narrower: آینه دوفام