آینه
preferred label: mirror @en
type: Concept
narrower: آینه چندتکه

آینه چندتکه
scope note: مجموعه‌ای از آینه‌های کوچک مجزا که در کنار هم مانند یک آینۀ واحد عمل می‌کنند.
broader: آینه
preferred label: segmented mirror @en
type: Concept