تلمبه
preferred label: pump @en
type: Concept
narrower: تلمبه ترازه

تلمبه ترازه
scope note: تلمبه‌ای برای پر و خالی کردن ترازۀ مایع از مخازن شناور
broader: تلمبه
preferred label: ballast pump @en
type: Concept