ریل آسیب‌دیده
preferred label: damaged rail @en
type: Concept
narrower: ریل تابیده

ریل تابیده
scope note: ریلی که به دلیل خروج قطار یا در حین حمل‌ونقل تاب برداشته باشد.
broader: ریل آسیب‌دیده
preferred label: crippled rail @en
type: Concept