ریل
preferred label: rail @en
type: Concept
narrower: ریل بریده

ریل بریده
scope note: ریلی که طول مشخصی از انتهای آن بریده شده است و در سمت داخلی قوس‌های تند کار گذاشته می‌شود.
broader: ریل
preferred label: make up rail @en
type: Concept