ریل سوم
preferred label: third rail @en
type: Concept
narrower: ریل سوم ترکیبی

ریل سوم ترکیبی
scope note: ریل سوم فولادی با تسمه‌های آلومینیمی در دو طرف جان ریل برای افزایش ظرفیت انتقال جریان الکتریکی
broader: ریل سوم
preferred label: composite third rail @en
type: Concept