تشدیدگر
preferred label: resonator @en
type: Concept
narrower: تشدیدگر باریکه

باریکه لیزر
preferred label: laser beam @en
type: Concept
related: تشدیدگر باریکه

تشدیدگر باریکه
scope note: ابزاری برای محصور کردن باریکۀ لیزر یا هر تابش الکترومغناطیسی در ناحیۀ مشخصی از فضا
related: باریکه لیزر
broader: تشدیدگر
preferred label: beam resonator @en
type: Concept