خشک‌کن نقاله‌ای
preferred label: conveyor dryer @en
type: Concept
narrower: خشک‌کن نقاله‌ای هم‌سو

خشک‌کن نقاله‌ای هم‌سو
scope note: نوعی خشک‌کن نقاله‌ای که در آن جهت حرکت تسمه‌نقالۀ حاوی مواد غذایی همسو با جریان هوای گرم است.
broader: خشک‌کن نقاله‌ای
preferred label: concurrent conveyor dryer @en
type: Concept