خشک‌کن نقاله‌ای دومرحله‌ای
scope note: نوعی خشک‌کن نقاله‌ای که در آن محصول در دو مرحلۀ متفاوت خشک می‌شود و دما و سرعت حرکت و ضخامت محصول در مرحلۀ اول و دوم متفاوت است.
broader: خشک‌کن نقاله‌ای
preferred label: two stage conveyor dryer @en
type: Concept

خشک‌کن نقاله‌ای
preferred label: conveyor dryer @en
type: Concept
narrower: خشک‌کن نقاله‌ای دومرحله‌ای