خشک‌کن غلتکی دوقلو
scope note: نوعی خشک‌کن غلتکی با دو غلتک مستقل و با فاصله از هم که از یک منبع تغذیه می‌شوند، ولی عمل مستقل از هم دارند.
broader: خشک‌کن غلتکی
preferred label: twin drum dryer @en
type: Concept

خشک‌کن غلتکی
preferred label: drum dryer @en
type: Concept
narrower: خشک‌کن غلتکی دوقلو