صافی دوسویه
scope note: صافی بستردانه‌ای که در آن جریان آب از بالا و پایین وارد و از وسط خارج میشود.
broader: پالایه (برای سیال)
preferred label: biflow filter @en
type: Concept

پالایه (برای سیال)
preferred label: filter (for fluid) @en
type: Concept
narrower: صافی دوسویه