صافی فشاری
scope note: دستگاهی متشکل از چند قاب صافی که سیال با فشار از آنها می‌گذرد و صاف می‌شود.
broader: پالایه (برای سیال)
preferred label: filter press @en
type: Concept

پالایه (برای سیال)
preferred label: filter (for fluid) @en
type: Concept
narrower: صافی فشاری