صافی شنی
scope note: نوعی صافی متشکل از چند بستر شنی و به‌صورت لایه‌لایه که از آن برای جدا کردن ذرات ریز معلق از آب یا سیال استفاده می‌کنند.
broader: پالایه (برای سیال)
preferred label: sand filter @en
type: Concept

پالایه (برای سیال)
preferred label: filter (for fluid) @en
type: Concept
narrower: صافی شنی