سپرگذاری بسامد رادیویی
scope note: فرایند جلوگیری از عبور بسامدهای رادیویی با استفاده از محفظه‌‌ای رسانا
broader: سپرگذاری
preferred label: radio-frequency shielding @en
type: Concept

سپرگذاری
preferred label: shielding @en
type: Concept
narrower: سپرگذاری بسامد رادیویی