خودسپری
scope note: حفاظت از بخش درونی سوخت هسته‌ای با استفاده از بخش بیرونی آن
broader: سپرگذاری
preferred label: self-shielding @en
type: Concept

سپرگذاری
preferred label: shielding @en
type: Concept
narrower: خودسپری