لنگر
preferred label: anchor @en
type: Concept
narrower: لنگر کج‌بیلی

لنگر کج‌بیلی
scope note: نوعی لنگر به شکل کج‌بیل که مناسب بسترهای ماسه‌ای سخت یا دارای پوشش‌های گیاهی است.
broader: لنگر
preferred label: spade anchor @en
type: Concept