آب
preferred label: water @en
type: Concept
narrower: آب سالم

سلامت
preferred label: health @en
type: Concept
related: آب سالم

آب سالم
scope note: آب عاری از مواد سمی و باکتری‌ها و مواد شیمیایی که آشامیدن آن برای سلامتی مضر نباشد، هرچند دارای طعم و بو و رنگ و برخی مواد معدنی باشد.
related: سلامت
broader: آب
preferred label: safe water @en
type: Concept