آب
preferred label: water @en
type: Concept
narrower: آب به‌حساب‌نیامده

آب به‌حساب‌نیامده
scope note: تفاوت بین آب تولیدی سالانه و آب مصرفی اندازه‌گیری‌شده که ناشی از نشت از شبکه و خطای شمارگر و دزدی آب است.
broader: آب
preferred label: unaccounted-for water @en
type: Concept