واکنشگاه خنک‌شده با آب
preferred label: water cooled reactor @en
type: Concept
narrower: واکنشگاه آب سنگین

واکنشگاه آب سنگین
alternative label: رآکتور آب سنگین
scope note: واکنشگاه/ رآکتوری هسته‌ای که در آن از آب سنگین به‌عنوان کندساز استفاده می‌شود.
broader: واکنشگاه خنک‌شده با آب
preferred label: heavy water reactor @en
type: Concept