بارگنجان
alternative label: باگ
scope note: محوطه‌ای در پایانۀ بندری که در آن بارگُنج‌های پر و خالی را نگهداری می‌کنند و از آنجا آنها را برای بارگیری به اسکله و برای باربندی یا سایر امور به فرستگاه بارگُنج ارسال می‌کنند.
related: بارگنج
broader: پایانه بارگنج
preferred label: container yard @en
type: Concept

بارگنج
preferred label: container @en
type: Concept
related: بارگنجان

پایانه بارگنج
preferred label: container terminal @en
type: Concept
narrower: بارگنجان