فاضلاب‌روی اصلی
scope note: فاضلاب‌روی که یک یا چند فاضلاب‌روِِ نیمه‌اصلی به آن تخلیه می‌شود.
broader: فاضلاب‌ر‌و
preferred label: main sewer @en
type: Concept

فاضلاب‌ر‌و
preferred label: sewer @en
type: Concept
narrower: فاضلاب‌روی اصلی