فاضلاب‌ر‌و
preferred label: sewer @en
type: Concept
narrower: فاضلاب‌روی نیمه‌اصلی

فاضلاب‌روی نیمه‌اصلی
scope note: فاضلاب‌روی که شماری فاضلاب‌روِِ فرعی به آن تخلیه می‌شود.
broader: فاضلاب‌ر‌و
preferred label: submain sewer @en
type: Concept