کمانش
preferred label: buckling @en
type: Concept
narrower: کمانش ناکشسان

کمانش ناکشسان
scope note: خمیدگی ساختاری جسم در گسترۀ فراتر از حد کشسانی براثر بار تراکمی
broader: کمانش
preferred label: inelastic buckling @en
type: Concept